Advertisement
Not a member of Pastebin yet?
Sign Up,
it unlocks many cool features!
- [root@localhost src]# cat /home/ffilz/ganesha/pynfs-results/TESTOUT.nfs4.1.all-ganesha.2017-09-29.V2.6-dev.12.fail
- Could not find gssapi module, proceeding without
- **************************************************
- CSESS25 st_create_session.testTooSmallMaxRS : FAILURE
- OP_CREATE_SESSION should return NFS4ERR_TOOSMALL,
- instead got NFS4_OK
- CSESS26 st_create_session.testRepTooBig : FAILURE
- OP_GETATTR should return NFS4ERR_REP_TOO_BIG, instead
- got NFS4_OK
- CSESS27 st_create_session.testRepTooBigToCache : FAILURE
- OP_SEQUENCE should return
- NFS4ERR_REP_TOO_BIG_TO_CACHE, instead got NFS4_OK
- CSESS28 st_create_session.testTooSmallMaxReq : FAILURE
- OP_CREATE_SESSION should return NFS4ERR_TOOSMALL,
- instead got NFS4_OK
- CSESS29 st_create_session.testDRCMemLeak : FAILURE
- OP_CREATE_SESSION should return NFS4ERR_TOOSMALL,
- instead got NFS4_OK
- DSESS9001 st_destroy_session.testDestroy : FAILURE
- OP_DESTROY_SESSION should return NFS4_OK, instead got
- NFS4ERR_CONN_NOT_BOUND_TO_SESSION
- DSESS9002 st_destroy_session.testDestroy2 : FAILURE
- OP_OPEN should return NFS4_OK, instead got
- NFS4ERR_GRACE
- DSESS9003 st_destroy_session.testDestroy3 : FAILURE
- OP_OPEN should return NFS4_OK, instead got
- NFS4ERR_GRACE
- EID50 st_exchange_id.testSSV : FAILURE
- AttributeError: 'ClientStateProtection' object has no
- attribute 'context'
- SEQ6 st_sequence.testRequestTooBig : FAILURE
- OP_LOOKUP should return NFS4ERR_REQ_TOO_BIG, instead
- got NFS4ERR_NAMETOOLONG
- SEQ10b st_sequence.testReplayCache007 : FAILURE
- OP_RENAME should return NFS4ERR_RETRY_UNCACHED_REP,
- instead got NFS4_OK
- **************************************************
- Command line asked for 175 of 212 tests
- Of those: 0 Skipped, 11 Failed, 0 Warned, 164 Passed
Advertisement
Add Comment
Please, Sign In to add comment
Advertisement