Advertisement
svenhoefer

Untitled

Dec 23rd, 2019
350
0
Never
Not a member of Pastebin yet? Sign Up, it unlocks many cool features!
text 1.29 KB | None | 0 0
  1. ../readline/libreadline.a ../opcodes/libopcodes.a ../bfd/libbfd.a -L./../zlib -lz /home/vanhofen/ni/buildsystem/root/lib/libintl.so -lc -Wl,-rpath -Wl,/home/vanhofen/ni/buildsystem/root/lib ../libiberty/libiberty.a ../libdecnumber/libdecnumber.a -lncurses -lm /home/vanhofen/ni/buildsystem/root/lib/libexpat.so -Wl,-rpath -Wl,/home/vanhofen/ni/buildsystem/root/lib ../libiberty/libiberty.a build-gnulib/import/libgnu.a -ldl -Wl,--dynamic-list=./proc-service.list
  2. /home/vanhofen/ni/buildsystem/cross/arm-linux-3.10.93/lib/gcc/arm-cortex-linux-uclibcgnueabi/6.3.1/libgcc_eh.a(unwind-arm.o): In function `__aeabi_unwind_cpp_pr0':
  3. /home/vanhofen/ni/buildsystem/build_tmp/crosstool-ng.git/targets/src/gcc-linaro-6.3-2017.02/libgcc/config/arm/unwind-arm.c:494: multiple definition of `__aeabi_unwind_cpp_pr0'
  4. /home/vanhofen/ni/buildsystem/cross/arm-linux-3.10.93/arm-cortex-linux-uclibcgnueabi/sys-root/usr/lib/uclibc_nonshared.a(aeabi_unwind_cpp_pr1.o):aeabi_unwind_cpp_pr1.c:(.text+0x0): first defined here
  5. collect2: error: ld returned 1 exit status
  6. Makefile:1923: recipe for target 'gdb' failed
  7. make[2]: *** [gdb] Error 1
  8. Makefile:9126: recipe for target 'all-gdb' failed
  9. make[1]: *** [all-gdb] Error 2
  10. make/target-development.mk:106: recipe for target 'gdb' failed
  11. make: *** [gdb] Error 2
Advertisement
Add Comment
Please, Sign In to add comment
Advertisement